Target
Sodium-dependent dopamine transporter
Ligand
BDBM50298610
Substrate
Meas. Tech.
ChEMBL_587777 (CHEMBL1040428)
IC50
28±n/a nM
Citation
 Jin, CNavarro, HAIvy Carroll, F Synthesis and structure-activity relationship of 3beta-(4-alkylthio, -methylsulfinyl, and -methylsulfonylphenyl)tropane and 3beta-(4-alkylthiophenyl)nortropane derivatives for monoamine transporters. Bioorg Med Chem 17:5126-32 (2009)  
Target
Name:
Sodium-dependent dopamine transporter
Synonyms:
DA transporter DAT1 Dopamine transporter protein (DAT) SC6A3_HUMAN Sodium-dependent dopamine transporter Solute carrier family 6 member 3
Type:
Multi-pass membrane protein
Mol. Mass.:
68497.11
Organism:
Homo sapiens (Human)
Description:
Q01959
Residue:
620
  
Inhibitor
Name:
BDBM50298610
Synonyms:
3beta-(4-Methylthiophenyl)nortropane-2beta-carboxylic acid methyl ester | CHEMBL574544
Type:
Small organic molecule
Emp. Form.:
C16H21NO2S
Mol. Mass.:
291.408
SMILES:
COC(=O)[C@@H]1C2CCC(C[C@@H]1c1ccc(SC)cc1)N2
: