Target
Sodium-dependent serotonin transporter
Ligand
BDBM50298610
Substrate
Meas. Tech.
ChEMBL_587778 (CHEMBL1040429)
Ki
0.19±n/a nM
Citation
 Jin, CNavarro, HAIvy Carroll, F Synthesis and structure-activity relationship of 3beta-(4-alkylthio, -methylsulfinyl, and -methylsulfonylphenyl)tropane and 3beta-(4-alkylthiophenyl)nortropane derivatives for monoamine transporters. Bioorg Med Chem 17:5126-32 (2009)  
Target
Name:
Sodium-dependent serotonin transporter
Synonyms:
5-HT Transporter 5HTT SC6A4_HUMAN SLC6A4 Serotonin transporter (5HTT) Sodium-dependent serotonin transporter (SERT) | Solute carrier family 6 member 4
Type:
Multi-pass membrane protein
Mol. Mass.:
70322.51
Organism:
Homo sapiens (Human)
Description:
P31645
Residue:
630
  
Inhibitor
Name:
BDBM50298610
Synonyms:
3beta-(4-Methylthiophenyl)nortropane-2beta-carboxylic acid methyl ester | CHEMBL574544
Type:
Small organic molecule
Emp. Form.:
C16H21NO2S
Mol. Mass.:
291.408
SMILES:
COC(=O)[C@@H]1C2CCC(C[C@@H]1c1ccc(SC)cc1)N2
: