Target
Sodium-dependent noradrenaline transporter
Ligand
BDBM50298610
Substrate
Meas. Tech.
ChEMBL_587779 (CHEMBL1040430)
Ki
21±n/a nM
Citation
 Jin, CNavarro, HAIvy Carroll, F Synthesis and structure-activity relationship of 3beta-(4-alkylthio, -methylsulfinyl, and -methylsulfonylphenyl)tropane and 3beta-(4-alkylthiophenyl)nortropane derivatives for monoamine transporters. Bioorg Med Chem 17:5126-32 (2009)  
Target
Name:
Sodium-dependent noradrenaline transporter
Synonyms:
Monoamine transporter NET Noradrenaline Transporter (NET) Norepinephrine transporter protein (NET) SLC6A2 Sodium-dependent noradrenaline transporter (NET) | Solute carrier family 6 member 2
Type:
Multi-pass membrane protein
Mol. Mass.:
69337.72
Organism:
Homo sapiens (Human)
Description:
P23975
Residue:
617
  
Inhibitor
Name:
BDBM50298610
Synonyms:
3beta-(4-Methylthiophenyl)nortropane-2beta-carboxylic acid methyl ester | CHEMBL574544
Type:
Small organic molecule
Emp. Form.:
C16H21NO2S
Mol. Mass.:
291.408
SMILES:
COC(=O)[C@@H]1C2CCC(C[C@@H]1c1ccc(SC)cc1)N2
: