Target
Metabotropic glutamate receptor 6
Ligand
BDBM50299480
Substrate
Meas. Tech.
ChEMBL_591059 (CHEMBL1052812)
IC50
10600±n/a nM
Citation
 Briel, DRybak, AKronbach, CUnverferth, K Substituted 2-aminothiopen-derivatives: a potential new class of GluR6-antagonists. Eur J Med Chem 45:69-77 (2010)  
Target
Name:
Metabotropic glutamate receptor 6
Synonyms:
GPRC1F GRM6_HUMAN Metabotropic glutamate receptor 6 metabotropic glutamate 6
Type:
Enzyme Catalytic Domain
Mol. Mass.:
95479.26
Organism:
Homo sapiens (Human)
Description:
metabotropic glutamate 6 GRM6 HUMAN::O15303
Residue:
877
  
Inhibitor
Name:
BDBM50299480
Synonyms:
(2-Amino-4-methyl-5-phenylthiophen-3-yl)(phenyl)methanone | CHEMBL566318
Type:
Small organic molecule
Emp. Form.:
C18H15NOS
Mol. Mass.:
293.383
SMILES:
Cc1c(C(=O)c2ccccc2)c(N)sc1-c1ccccc1
: