Target
Metabotropic glutamate receptor 6
Ligand
BDBM50299484
Substrate
Meas. Tech.
ChEMBL_591059 (CHEMBL1052812)
IC50
21000±n/a nM
Citation
 Briel, DRybak, AKronbach, CUnverferth, K Substituted 2-aminothiopen-derivatives: a potential new class of GluR6-antagonists. Eur J Med Chem 45:69-77 (2010)  
Target
Name:
Metabotropic glutamate receptor 6
Synonyms:
GPRC1F GRM6_HUMAN Metabotropic glutamate receptor 6 metabotropic glutamate 6
Type:
Enzyme Catalytic Domain
Mol. Mass.:
95479.26
Organism:
Homo sapiens (Human)
Description:
metabotropic glutamate 6 GRM6 HUMAN::O15303
Residue:
877
  
Inhibitor
Name:
BDBM50299484
Synonyms:
CHEMBL584345 | Ethyl 2-(cyanodiazenyl)-4-methyl-5-phenylthiophene-3-carboxylate
Type:
Small organic molecule
Emp. Form.:
C15H13N3O2S
Mol. Mass.:
299.348
SMILES:
CCOC(=O)c1c(C)c(sc1N=NC#N)-c1ccccc1
: