Target
Metabotropic glutamate receptor 6
Ligand
BDBM50185321
Substrate
Meas. Tech.
ChEMBL_591059 (CHEMBL1052812)
IC50
23000±n/a nM
Citation
 Briel, DRybak, AKronbach, CUnverferth, K Substituted 2-aminothiopen-derivatives: a potential new class of GluR6-antagonists. Eur J Med Chem 45:69-77 (2010)  
Target
Name:
Metabotropic glutamate receptor 6
Synonyms:
GPRC1F GRM6_HUMAN Metabotropic glutamate receptor 6 metabotropic glutamate 6
Type:
Enzyme Catalytic Domain
Mol. Mass.:
95479.26
Organism:
Homo sapiens (Human)
Description:
metabotropic glutamate 6 GRM6 HUMAN::O15303
Residue:
877
  
Inhibitor
Name:
BDBM50185321
Synonyms:
6-cyano-7-nitroquinoxaline-2,3-dione CHEMBL9790
Type:
Small organic molecule
Emp. Form.:
C9H2N4O4
Mol. Mass.:
230.1366
SMILES:
[O-][N+](=O)c1cc2=NC(=O)C(=O)N=c2cc1C#N
: