Target
Non-receptor tyrosine-protein kinase TYK2
Ligand
BDBM50301356
Substrate
Meas. Tech.
ChEMBL_599554 (CHEMBL1038364)
IC50
>1000±n/a nM
Citation
 Allen, JGLee, MRHan, CYScherrer, JFlynn, SBoucher, CZhao, HO'Connor, ABRoveto, PBauer, DGraceffa, RRichards, WGBabij, P Identification of small molecule inhibitors of proline-rich tyrosine kinase 2 (Pyk2) with osteogenic activity in osteoblast cells. Bioorg Med Chem Lett 19:4924-8 (2009)  
Target
Name:
Non-receptor tyrosine-protein kinase TYK2
Synonyms:
Non-receptor tyrosine-protein kinase TYK2 (TYK2) TYK2_HUMAN | Tyrosine-protein kinase TYK2
Type:
Protein
Mol. Mass.:
133666.03
Organism:
Homo sapiens (Human)
Description:
P29597
Residue:
1187
  
Inhibitor
Name:
BDBM50301356
Synonyms:
CHEMBL585927 | N-(5-(6,7-dimethoxyquinolin-4-yloxy)pyridin-2-yl)-4-(methylamino)-2-oxo-1-phenyl-1,2-dihydropyridine-3-carboxamide
Type:
Small organic molecule
Emp. Form.:
C29H25N5O5
Mol. Mass.:
523.5393
SMILES:
CNc1ccn(-c2ccccc2)c(=O)c1C(=O)Nc1ccc(Oc2ccnc3cc(OC)c(OC)cc23)cn1
: