Target
Prostaglandin G/H synthase 1
Ligand
BDBM50303151
Substrate
Meas. Tech.
ChEMBL_594667 (CHEMBL1037160)
IC50
77900±n/a nM
Citation
 Coy, EDCuca, LESefkow, M COX, LOX and platelet aggregation inhibitory properties of Lauraceae neolignans. Bioorg Med Chem Lett 19:6922-5 (2009)  
Target
Name:
Prostaglandin G/H synthase 1
Synonyms:
COX1 Cyclooxygenase-1 (COX-1) PTGS1 | Prostaglandin G/H synthase (cyclooxygenase)
Type:
Protein
Mol. Mass.:
68868.60
Organism:
Ovis aries (Sheep)
Description:
Residue:
600
  
Inhibitor
Name:
BDBM50303151
Synonyms:
CHEMBL570291 | Mirandin A
Type:
Small organic molecule
Emp. Form.:
C22H26O6
Mol. Mass.:
386.4382
SMILES:
COc1cc(cc(OC)c1OC)[C@H]1OC2=CC(=O)C(CC=C)=C[C@]2(OC)[C@@H]1C
: