Target
Prostaglandin G/H synthase 2
Ligand
BDBM50303151
Substrate
Meas. Tech.
ChEMBL_594668 (CHEMBL1037161)
IC50
126000±n/a nM
Citation
 Coy, EDCuca, LESefkow, M COX, LOX and platelet aggregation inhibitory properties of Lauraceae neolignans. Bioorg Med Chem Lett 19:6922-5 (2009)  
Target
Name:
Prostaglandin G/H synthase 2
Synonyms:
COX2 Cyclooxygenase-2 (COX-2) PTGS2 Prostaglandin G/H synthase (cyclooxygenase)
Type:
Protein
Mol. Mass.:
68976.98
Organism:
Ovis aries (Sheep)
Description:
Residue:
603
  
Inhibitor
Name:
BDBM50303151
Synonyms:
CHEMBL570291 | Mirandin A
Type:
Small organic molecule
Emp. Form.:
C22H26O6
Mol. Mass.:
386.4382
SMILES:
COc1cc(cc(OC)c1OC)[C@H]1OC2=CC(=O)C(CC=C)=C[C@]2(OC)[C@@H]1C
: