Target
G-protein coupled bile acid receptor 1
Ligand
BDBM50236238
Substrate
Meas. Tech.
ChEMBL_595939 (CHEMBL1041788)
EC50
5600±n/a nM
Citation
 Genet, CStrehle, ASchmidt, CBoudjelal, GLobstein, ASchoonjans, KSouchet, MAuwerx, JSaladin, RWagner, A Structure-activity relationship study of betulinic acid, a novel and selective TGR5 agonist, and its synthetic derivatives: potential impact in diabetes. J Med Chem 53:178-90 (2010)  
Target
Name:
G-protein coupled bile acid receptor 1
Synonyms:
BG37 GPBAR_HUMAN TGR5 hGPCR19
Type:
G Protein-Coupled Receptor (GPCR)
Mol. Mass.:
35260.02
Organism:
Homo sapiens (Human)
Description:
CHO cells transiently transfected with hTGR5.
Residue:
330
  
Inhibitor
Name:
BDBM50236238
Synonyms:
(3alpha,5beta)-3-hydroxycholan-24-oic acid 3alpha-hydroxy-5beta-cholanic acid 5beta-cholanic acid-3alpha-ol LCA lithocholic acid
Type:
Small organic molecule
Emp. Form.:
C24H40O3
Mol. Mass.:
376.5726
SMILES:
C[C@H](CCC(O)=O)[C@H]1CC[C@H]2[C@@H]3CC[C@@H]4C[C@H](O)CC[C@]4(C)[C@H]3CC[C@]12C
: