Target
Indoleamine 2,3-dioxygenase 1
Ligand
BDBM32203
Substrate
Meas. Tech.
ChEMBL_595171 (CHEMBL1040013)
IC50
750000±n/a nM
Citation
 Röhrig, UFAwad, LGrosdidier, ALarrieu, PStroobant, VColau, DCerundolo, VSimpson, AJVogel, PVan den Eynde, BJZoete, VMichielin, O Rational design of indoleamine 2,3-dioxygenase inhibitors. J Med Chem 53:1172-89 (2010)  
Target
Name:
Indoleamine 2,3-dioxygenase 1
Synonyms:
I23O1_HUMAN IDO-1 INDO Indoleamine 2,3-dioxygenase | Indoleamine-pyrrole 2,3-dioxygenase
Type:
Enzyme
Mol. Mass.:
45330.80
Organism:
Homo sapiens (Human)
Description:
P14902
Residue:
403
  
Inhibitor
Name:
BDBM32203
Synonyms:
8-quinolinol US10005735, Table 1.7 cid_1923 quinolin-8-ol
Type:
Small organic molecule
Emp. Form.:
C9H7NO
Mol. Mass.:
145.158
SMILES:
Oc1cccc2cccnc12
: