Target
Type-1 angiotensin II receptor A
Ligand
BDBM50303983
Substrate
Meas. Tech.
ChEMBL_595237 (CHEMBL1043589)
Ki
>10000±n/a nM
Citation
 Mizuno, CSChittiboyina, AGShah, FHPatny, AKurtz, TWPershadsingh, HASpeth, RCKaramyan, VTCarvalho, PBAvery, MA Design, synthesis, and docking studies of novel benzimidazoles for the treatment of metabolic syndrome. J Med Chem 53:1076-85 (2010)  
Target
Name:
Type-1 angiotensin II receptor A
Synonyms:
AGTRA_RAT Agtr1 Angiotensin II AT1 Angiotensin II receptor (AT-1) type-1 Type-1A angiotensin II receptor
Type:
Enzyme Catalytic Domain
Mol. Mass.:
40910.53
Organism:
RAT
Description:
ANGIOTENSIN AT1 AGTR1 RAT::P25095
Residue:
359
  
Inhibitor
Name:
BDBM50303983
Synonyms:
CHEMBL565793 | ethyl 2-(4-((4-methyl-2-propyl-1H-benzo[d]imidazol-1-yl)methyl)phenoxy)acetate
Type:
Small organic molecule
Emp. Form.:
C22H26N2O3
Mol. Mass.:
366.4534
SMILES:
CCCc1nc2c(C)cccc2n1Cc1ccc(OCC(=O)OCC)cc1
: