Target
Protein kinase C theta type
Ligand
BDBM50099066
Substrate
Meas. Tech.
ChEMBL_609375 (CHEMBL1072761)
EC50
3190±n/a nM
Citation
 Majhi, ARahman, GMPanchal, SDas, J Binding of curcumin and its long chain derivatives to the activator binding domain of novel protein kinase C. Bioorg Med Chem 18:1591-8 (2010)  
Target
Name:
Protein kinase C theta type
Synonyms:
KPCT_HUMAN PRKCT Protein kinase C theta type (PRKCQ) nPKC-theta
Type:
Serine/threonine-protein kinase
Mol. Mass.:
81878.04
Organism:
Homo sapiens (Human)
Description:
Full-length human PKC theta (Panvera Catalog No. P2996).
Residue:
706
  
Inhibitor
Name:
BDBM50099066
Synonyms:
CHEMBL279115 | phorbol 13-acetate 12-myristate
Type:
Small organic molecule
Emp. Form.:
C36H56O8
Mol. Mass.:
616.825
SMILES:
CCCCCCCCCCCCCC(=O)O[C@@H]1[C@@H](C)[C@]2(O)[C@@H]3C=C(C)C(=O)[C@@]3(O)CC(CO)=C[C@H]2[C@@H]2C(C)(C)[C@]12OC(C)=O
: