Target
5-hydroxytryptamine receptor 3A
Ligand
BDBM50307821
Substrate
Meas. Tech.
ChEMBL_612614 (CHEMBL1065651)
Ki
279±n/a nM
Citation
 Vernekar, SKHallaq, HYClarkson, GThompson, AJSilvestri, LLummis, SCLochner, M Toward biophysical probes for the 5-HT3 receptor: structure-activity relationship study of granisetron derivatives. J Med Chem 53:2324-8 (2010)  
Target
Name:
5-hydroxytryptamine receptor 3A
Synonyms:
5-HT-3 5-HT3A 5-hydroxytryptamine receptor 3 (5-HT3) 5-hydroxytryptamine receptor 3A (5HT3A) 5HT3R HTR3A Serotonin 3 receptor (5HT3) Serotonin-gated ion channel receptor | Serotonin-gated ion channel receptor 3
Type:
Protein
Mol. Mass.:
55283.27
Organism:
Homo sapiens (Human)
Description:
P46098
Residue:
478
  
Inhibitor
Name:
BDBM50307821
Synonyms:
6-Hydroxy-1-methyl-N-[(3-endo)-9-methyl-9-azabicyclo[3.3.1]non-3-yl]-1H-indazole-3-carboxamide | CHEMBL603673
Type:
Small organic molecule
Emp. Form.:
C18H24N4O2
Mol. Mass.:
328.4088
SMILES:
CN1[C@H]2CCC[C@H]1CC(C2)NC(=O)c1nn(C)c2cc(O)ccc12
: