Target
D(2) dopamine receptor
Ligand
BDBM50241119
Substrate
Meas. Tech.
ChEMBL_608752 (CHEMBL1067765)
Ki
2.2±n/a nM
Citation
 Neves, GMenegatti, RAntonio, CBGrazziottin, LRVieira, RORates, SMNoël, FBarreiro, EJFraga, CA Searching for multi-target antipsychotics: Discovery of orally active heterocyclic N-phenylpiperazine ligands of D2-like and 5-HT1A receptors. Bioorg Med Chem 18:1925-35 (2010)  
Target
Name:
D(2) dopamine receptor
Synonyms:
D(2) dopamine receptor DOPAMINE D2 Long DRD2 Dopamine D2 receptor Dopamine D2 receptor (D2R) Dopamine2-like | d2
Type:
Cell-surface receptors
Mol. Mass.:
50647.10
Organism:
Homo sapiens (Human)
Description:
P14416
Residue:
443
  
Inhibitor
Name:
BDBM50241119
Synonyms:
7-(4-Biphenyl-3-ylmethyl-piperazin-1-yl)-3H-benzooxazol-2-one CHEMBL218166
Type:
Small organic molecule
Emp. Form.:
C24H23N3O2
Mol. Mass.:
385.4583
SMILES:
O=c1[nH]c2cccc(N3CCN(Cc4cccc(c4)-c4ccccc4)CC3)c2o1
: