Target
5-hydroxytryptamine receptor 1A
Ligand
BDBM50308012
Substrate
Meas. Tech.
ChEMBL_608746 (CHEMBL1067759)
Ki
>4440±n/a nM
Citation
 Neves, GMenegatti, RAntonio, CBGrazziottin, LRVieira, RORates, SMNoël, FBarreiro, EJFraga, CA Searching for multi-target antipsychotics: Discovery of orally active heterocyclic N-phenylpiperazine ligands of D2-like and 5-HT1A receptors. Bioorg Med Chem 18:1925-35 (2010)  
Target
Name:
5-hydroxytryptamine receptor 1A
Synonyms:
5-HT-1A 5-HT1A 5-hydroxytryptamine receptor 1A (5HT1A) 5ht1a Htr1a Serotonin 1a (5-HT1a) receptor/Adrenergic receptor alpha-1 | Serotonin receptor 1A
Type:
G Protein-Coupled Receptor (GPCR)
Mol. Mass.:
46445.29
Organism:
Rattus norvegicus (rat)
Description:
Binding assays were performed using rat hippocampal membranes.
Residue:
422
  
Inhibitor
Name:
BDBM50308012
Synonyms:
1-(4-Chlorophenyl)-4-{[1-(4-chlorophenyl)-1H-1,2,3-triazol-4-yl]methyl}piperazine | CHEMBL597411
Type:
Small organic molecule
Emp. Form.:
C19H19Cl2N5
Mol. Mass.:
388.294
SMILES:
Clc1ccc(cc1)N1CCN(Cc2cn(nn2)-c2ccc(Cl)cc2)CC1
: