Target
5-hydroxytryptamine receptor 2A
Ligand
BDBM50308012
Substrate
Meas. Tech.
ChEMBL_608747 (CHEMBL1067760)
Ki
3220±n/a nM
Citation
 Neves, GMenegatti, RAntonio, CBGrazziottin, LRVieira, RORates, SMNoël, FBarreiro, EJFraga, CA Searching for multi-target antipsychotics: Discovery of orally active heterocyclic N-phenylpiperazine ligands of D2-like and 5-HT1A receptors. Bioorg Med Chem 18:1925-35 (2010)  
Target
Name:
5-hydroxytryptamine receptor 2A
Synonyms:
5-HT-2A 5-HT2A 5-hydroxytryptamine receptor 2A (5HT2A) Htr2 Serotonin Receptor 2A
Type:
G Protein-Coupled Receptor (GPCR)
Mol. Mass.:
52852.05
Organism:
Rattus norvegicus (rat)
Description:
Rat cortex membranes 5-HT2A receptors.
Residue:
471
  
Inhibitor
Name:
BDBM50308012
Synonyms:
1-(4-Chlorophenyl)-4-{[1-(4-chlorophenyl)-1H-1,2,3-triazol-4-yl]methyl}piperazine | CHEMBL597411
Type:
Small organic molecule
Emp. Form.:
C19H19Cl2N5
Mol. Mass.:
388.294
SMILES:
Clc1ccc(cc1)N1CCN(Cc2cn(nn2)-c2ccc(Cl)cc2)CC1
: