Target
Serine/threonine-protein kinase Chk2
Ligand
BDBM50309203
Substrate
Meas. Tech.
ChEMBL_608836 (CHEMBL1069055)
IC50
1350±n/a nM
Citation
 Hilton, SNaud, SCaldwell, JJBoxall, KBurns, SAnderson, VEAntoni, LAllen, CEPearl, LHOliver, AWWynne Aherne, GGarrett, MDCollins, I Identification and characterisation of 2-aminopyridine inhibitors of checkpoint kinase 2. Bioorg Med Chem 18:707-18 (2010)  
Target
Name:
Serine/threonine-protein kinase Chk2
Synonyms:
CDS1 CHK2 Checkpoint Kinase (Chk2) Serine/threonine-protein kinase Chek2 | Serine/threonine-protein kinase Chk1/2
Type:
Protein
Mol. Mass.:
60908.59
Organism:
Homo sapiens (Human)
Description:
O96017
Residue:
543
  
Inhibitor
Name:
BDBM50309203
Synonyms:
4-(2-Amino-5-(benzo[d][1,3]dioxol-5-yl)pyridin-3-yl)benzamide | CHEMBL590079
Type:
Small organic molecule
Emp. Form.:
C19H15N3O3
Mol. Mass.:
333.3407
SMILES:
NC(=O)c1ccc(cc1)-c1cc(cnc1N)-c1ccc2OCOc2c1
: