Target
Serine/threonine-protein kinase Chk2
Ligand
BDBM50309210
Substrate
Meas. Tech.
ChEMBL_608836 (CHEMBL1069055)
IC50
600±n/a nM
Citation
 Hilton, SNaud, SCaldwell, JJBoxall, KBurns, SAnderson, VEAntoni, LAllen, CEPearl, LHOliver, AWWynne Aherne, GGarrett, MDCollins, I Identification and characterisation of 2-aminopyridine inhibitors of checkpoint kinase 2. Bioorg Med Chem 18:707-18 (2010)  
Target
Name:
Serine/threonine-protein kinase Chk2
Synonyms:
CDS1 CHK2 Checkpoint Kinase (Chk2) Serine/threonine-protein kinase Chek2 | Serine/threonine-protein kinase Chk1/2
Type:
Protein
Mol. Mass.:
60908.59
Organism:
Homo sapiens (Human)
Description:
O96017
Residue:
543
  
Inhibitor
Name:
BDBM50309210
Synonyms:
4-(2-Amino-5-(3-methoxyphenyl)pyridin-3-yl)benzamide | CHEMBL590809
Type:
Small organic molecule
Emp. Form.:
C19H17N3O2
Mol. Mass.:
319.3572
SMILES:
COc1cccc(c1)-c1cnc(N)c(c1)-c1ccc(cc1)C(N)=O
: