Target
Tyrosine-protein kinase JAK2
Ligand
BDBM50313051
Substrate
Meas. Tech.
ChEMBL_616303 (CHEMBL1102106)
Ki
>4000±n/a nM
Citation
 Arnost, MPierce, Ater Haar, ELauffer, DMadden, JTanner, KGreen, J 3-Aryl-4-(arylhydrazono)-1H-pyrazol-5-ones: Highly ligand efficient and potent inhibitors of GSK3beta. Bioorg Med Chem Lett 20:1661-4 (2010)  
Target
Name:
Tyrosine-protein kinase JAK2
Synonyms:
JAK-2 JAK2_HUMAN Janus kinase 2 (JAK2) | Janus kinase 2 (a protein tyrosine kinase)
Type:
Protein
Mol. Mass.:
130684.68
Organism:
Homo sapiens (Human)
Description:
O60674
Residue:
1132
  
Inhibitor
Name:
BDBM50313051
Synonyms:
(Z)-3-(4-methoxyphenyl)-4-(2-(pyridin-3-yl)hydrazono)-1H-pyrazol-5(4H)-one | CHEMBL1076721
Type:
Small organic molecule
Emp. Form.:
C15H13N5O2
Mol. Mass.:
295.296
SMILES:
COc1ccc(cc1)-c1[nH][nH]c(=O)c1N=Nc1cccnc1
: