Target
Receptor-type tyrosine-protein kinase FLT3
Ligand
BDBM50349806
Substrate
Meas. Tech.
ChEMBL_614228 (CHEMBL1106056)
IC50
>10000±n/a nM
Citation
 Choi, SJMoon, MJLee, SDChoi, SUHan, SYKim, YC Indirubin derivatives as potent FLT3 inhibitors with anti-proliferative activity of acute myeloid leukemic cells. Bioorg Med Chem Lett 20:2033-7 (2010)  
Target
Name:
Receptor-type tyrosine-protein kinase FLT3
Synonyms:
CD135 FL cytokine receptor FLK2 FLT3 Fetal liver kinase-2 Fms-like tyrosine kinase 3 (Flt-3) STK-1 Stem cell tyrosine kinase 1
Type:
Enzyme
Mol. Mass.:
112888.62
Organism:
Homo sapiens (Human)
Description:
P36888
Residue:
993
  
Inhibitor
Name:
BDBM50349806
Synonyms:
INDIRUBIN
Type:
Small organic molecule
Emp. Form.:
C16H10N2O2
Mol. Mass.:
262.2628
SMILES:
O=C1Nc2ccccc2\C1=C1/Nc2ccccc2C1=O
: