Target
Beta-3 adrenergic receptor
Ligand
BDBM50313923
Substrate
Meas. Tech.
ChEMBL_615503 (CHEMBL1105981)
EC50
16±n/a nM
Citation
 Goble, SDWang, LHowell, KLBansal, ABerger, RBrockunier, LDiSalvo, JFeighner, SHarper, BHe, JHurley, AHreniuk, DParmee, ERobbins, MSalituro, GSanfiz, AStreckfuss, EWatkins, EWeber, AEStruthers, MEdmondson, SD Heterocyclic acetamide and benzamide derivatives as potent and selective beta3-adrenergic receptor agonists with improved rodent pharmacokinetic profiles. Bioorg Med Chem Lett 20:1895-9 (2010)  
Target
Name:
Beta-3 adrenergic receptor
Synonyms:
ADRB3 ADRB3_HUMAN Beta-2 adrenergic receptor and beta-3 adrenergic receptor Beta-3 adrenoreceptor | adrenergic Beta3
Type:
G Protein-Coupled Receptor (GPCR)
Mol. Mass.:
43534.88
Organism:
Homo sapiens (Human)
Description:
Residue:
408
  
Inhibitor
Name:
BDBM50313923
Synonyms:
(R)-2-(5,6-dimethyl-4-oxothieno[2,3-d]pyrimidin-3(4H)-yl)-N-(4-(2-(2-hydroxy-2-(pyridin-3-yl)ethylamino)ethyl)phenyl)acetamide | CHEMBL1084145
Type:
Small organic molecule
Emp. Form.:
C25H27N5O3S
Mol. Mass.:
477.579
SMILES:
Cc1sc2ncn(CC(=O)Nc3ccc(CCNC[C@H](O)c4cccnc4)cc3)c(=O)c2c1C
: