Target
Metabotropic glutamate receptor 2
Ligand
BDBM50314793
Substrate
Meas. Tech.
ChEMBL_627223 (CHEMBL1110792)
EC50
52000±n/a nM
Citation
 Selvam, COueslati, NLemasson, IABrabet, IRigault, DCourtiol, TCesarini, STriballeau, NBertrand, HOGoudet, CPin, JPAcher, FC A virtual screening hit reveals new possibilities for developing group III metabotropic glutamate receptor agonists. J Med Chem 53:2797-813 (2010)  
Target
Name:
Metabotropic glutamate receptor 2
Synonyms:
GPRC1B GRM2_HUMAN Metabotropic glutamate receptor mGlu2 | metabotropic glutamate 2
Type:
Enzyme
Mol. Mass.:
95584.88
Organism:
Homo sapiens (Human)
Description:
Q14416
Residue:
872
  
Inhibitor
Name:
BDBM50314793
Synonyms:
(S)-3-amino-3-carboxypropyl-2'-carboxyethyl phosphinic acid | CHEMBL1089515
Type:
Small organic molecule
Emp. Form.:
C7H14NO6P
Mol. Mass.:
239.1629
SMILES:
N[C@@H](CCP(O)(=O)CCC(O)=O)C(O)=O
: