Target
Metabotropic glutamate receptor 4
Ligand
BDBM50314793
Substrate
Meas. Tech.
ChEMBL_627218 (CHEMBL1115329)
EC50
6150±n/a nM
Citation
 Selvam, COueslati, NLemasson, IABrabet, IRigault, DCourtiol, TCesarini, STriballeau, NBertrand, HOGoudet, CPin, JPAcher, FC A virtual screening hit reveals new possibilities for developing group III metabotropic glutamate receptor agonists. J Med Chem 53:2797-813 (2010)  
Target
Name:
Metabotropic glutamate receptor 4
Synonyms:
GRM4_RAT Grm4 Metabotropic glutamate receptor 4 (mGlu4) mGlu4 metabotropic glutamate 4a
Type:
Enzyme
Mol. Mass.:
101849.79
Organism:
Rattus norvegicus (Rat)
Description:
P31423
Residue:
912
  
Inhibitor
Name:
BDBM50314793
Synonyms:
(S)-3-amino-3-carboxypropyl-2'-carboxyethyl phosphinic acid | CHEMBL1089515
Type:
Small organic molecule
Emp. Form.:
C7H14NO6P
Mol. Mass.:
239.1629
SMILES:
N[C@@H](CCP(O)(=O)CCC(O)=O)C(O)=O
: