Target
Metabotropic glutamate receptor 6
Ligand
BDBM50314793
Substrate
Meas. Tech.
ChEMBL_627226 (CHEMBL1110795)
EC50
31000±n/a nM
Citation
 Selvam, COueslati, NLemasson, IABrabet, IRigault, DCourtiol, TCesarini, STriballeau, NBertrand, HOGoudet, CPin, JPAcher, FC A virtual screening hit reveals new possibilities for developing group III metabotropic glutamate receptor agonists. J Med Chem 53:2797-813 (2010)  
Target
Name:
Metabotropic glutamate receptor 6
Synonyms:
GRM6_RAT Grm6 Metabotropic glutamate receptor 6 (mGlu6) mGlu6 | metabotropic glutamate 6
Type:
Enzyme
Mol. Mass.:
95095.82
Organism:
Rattus norvegicus (Rat)
Description:
P35349
Residue:
871
  
Inhibitor
Name:
BDBM50314793
Synonyms:
(S)-3-amino-3-carboxypropyl-2'-carboxyethyl phosphinic acid | CHEMBL1089515
Type:
Small organic molecule
Emp. Form.:
C7H14NO6P
Mol. Mass.:
239.1629
SMILES:
N[C@@H](CCP(O)(=O)CCC(O)=O)C(O)=O
: