Target
Dihydrofolate reductase
Ligand
BDBM50316115
Substrate
Meas. Tech.
ChEMBL_623483 (CHEMBL1113554)
IC50
2000±n/a nM
Citation
 Al-Omary, FAAbou-Zeid, LANagi, MNHabib, el-SEAbdel-Aziz, AAEl-Azab, ASAbdel-Hamide, SGAl-Omar, MAAl-Obaid, AMEl-Subbagh, HI Non-classical antifolates. Part 2: synthesis, biological evaluation, and molecular modeling study of some new 2,6-substituted-quinazolin-4-ones. Bioorg Med Chem 18:2849-63 (2010)  
Target
Name:
Dihydrofolate reductase
Synonyms:
DHFR Dihydrofolate reductase (DHFR) | Tetrahydrofolate dehydrogenase
Type:
Enzyme
Mol. Mass.:
21453.99
Organism:
Homo sapiens (Human)
Description:
Recombinant human DHFR.
Residue:
187
  
Inhibitor
Name:
BDBM50316115
Synonyms:
3-Benzyl-6-cinnamylamino-2-methylthio-quinazolin-4(3H)-one | CHEMBL1090897
Type:
Small organic molecule
Emp. Form.:
C25H23N3OS
Mol. Mass.:
413.535
SMILES:
CSc1nc2ccc(NC\C=C\c3ccccc3)cc2c(=O)n1Cc1ccccc1
: