Target
Dihydrofolate reductase
Ligand
BDBM50316123
Substrate
Meas. Tech.
ChEMBL_623483 (CHEMBL1113554)
IC50
1000±n/a nM
Citation
 Al-Omary, FAAbou-Zeid, LANagi, MNHabib, el-SEAbdel-Aziz, AAEl-Azab, ASAbdel-Hamide, SGAl-Omar, MAAl-Obaid, AMEl-Subbagh, HI Non-classical antifolates. Part 2: synthesis, biological evaluation, and molecular modeling study of some new 2,6-substituted-quinazolin-4-ones. Bioorg Med Chem 18:2849-63 (2010)  
Target
Name:
Dihydrofolate reductase
Synonyms:
DHFR Dihydrofolate reductase (DHFR) | Tetrahydrofolate dehydrogenase
Type:
Enzyme
Mol. Mass.:
21453.99
Organism:
Homo sapiens (Human)
Description:
Recombinant human DHFR.
Residue:
187
  
Inhibitor
Name:
BDBM50316123
Synonyms:
CHEMBL1093244 | N-(3-Benzyl-2-methylthio-4-oxo-3,4-dihydroquinazolin-6-yl)-cinnamamide
Type:
Small organic molecule
Emp. Form.:
C25H21N3O2S
Mol. Mass.:
427.518
SMILES:
CSc1nc2ccc(NC(=O)\C=C\c3ccccc3)cc2c(=O)n1Cc1ccccc1
: