Target
Dihydrofolate reductase
Ligand
BDBM50316118
Substrate
Meas. Tech.
ChEMBL_623482 (CHEMBL1113553)
IC50
800±n/a nM
Citation
 Al-Omary, FAAbou-Zeid, LANagi, MNHabib, el-SEAbdel-Aziz, AAEl-Azab, ASAbdel-Hamide, SGAl-Omar, MAAl-Obaid, AMEl-Subbagh, HI Non-classical antifolates. Part 2: synthesis, biological evaluation, and molecular modeling study of some new 2,6-substituted-quinazolin-4-ones. Bioorg Med Chem 18:2849-63 (2010)  
Target
Name:
Dihydrofolate reductase
Synonyms:
DHFR Dihydrofolate reductase | Dihydrofolate reductase (DHFR)
Type:
Enzyme
Mol. Mass.:
21603.71
Organism:
Bos taurus (Cattle)
Description:
P00376
Residue:
187
  
Inhibitor
Name:
BDBM50316118
Synonyms:
6-Allylamino-2-allylthio-3-benzyl-quinazolin-4(3H)-one | CHEMBL1092683
Type:
Small organic molecule
Emp. Form.:
C21H21N3OS
Mol. Mass.:
363.476
SMILES:
C=CCNc1ccc2nc(SCC=C)n(Cc3ccccc3)c(=O)c2c1
: