Target
Cytochrome P450 3A4
Ligand
BDBM50316571
Substrate
Meas. Tech.
ChEMBL_631458 (CHEMBL1111995)
IC50
923±n/a nM
Citation
 Kraus, JMTatipaka, HBMcGuffin, SAChennamaneni, NKKarimi, MArif, JVerlinde, CLBuckner, FSGelb, MH Second generation analogues of the cancer drug clinical candidate tipifarnib for anti-Chagas disease drug discovery. J Med Chem 53:3887-98 (2010)  
Target
Name:
Cytochrome P450 3A4
Synonyms:
Albendazole monooxygenase CP3A4_HUMAN CYP3A4 CYPIIIA4 Cytochrome P450 3A4 (CYP3A4) Nifedipine oxidase Taurochenodeoxycholate 6-alpha-hydroxylase
Type:
Enzyme
Mol. Mass.:
57349.57
Organism:
Homo sapiens (Human)
Description:
Residue:
503
  
Inhibitor
Name:
BDBM50316571
Synonyms:
4-(4-chlorophenyl)-6-((4-chlorophenyl)(methoxy)(1-methyl-1H-imidazol-5-yl)methyl)-1-methylquinolin-2(1H)-one | CHEMBL1097078
Type:
Small organic molecule
Emp. Form.:
C28H23Cl2N3O2
Mol. Mass.:
504.407
SMILES:
COC(c1cncn1C)(c1ccc(Cl)cc1)c1ccc2n(C)c(=O)cc(-c3ccc(Cl)cc3)c2c1
: