Target
Glycogen phosphorylase, muscle form
Ligand
BDBM50351158
Substrate
Meas. Tech.
ChEMBL_631479 (CHEMBL1114713)
Ki
1700000±n/a nM
Citation
 Tsirkone, VGTsoukala, ELamprakis, CManta, SHayes, JMSkamnaki, VTDrakou, CZographos, SEKomiotis, DLeonidas, DD 1-(3-Deoxy-3-fluoro-beta-d-glucopyranosyl) pyrimidine derivatives as inhibitors of glycogen phosphorylase b: Kinetic, crystallographic and modelling studies. Bioorg Med Chem 18:3413-25 (2010)  
Target
Name:
Glycogen phosphorylase, muscle form
Synonyms:
Glycogen Phosphorylase (PYGM) Glycogen phosphorylase, muscle form PYGM | PYGM_RABIT
Type:
Enzyme
Mol. Mass.:
97296.32
Organism:
Oryctolagus cuniculus (rabbit)
Description:
Phosphorylation of Ser-15 converts phosphorylase B (unphosphorylated) to phosphorylase A.
Residue:
843
  
Inhibitor
Name:
BDBM50351158
Synonyms:
CHEMBL423707
Type:
Small organic molecule
Emp. Form.:
C6H12O6
Mol. Mass.:
180.1559
SMILES:
OC[C@H]1O[C@H](O)[C@H](O)[C@@H](O)[C@@H]1O
: