Target
Melatonin receptor type 1A
Ligand
BDBM50316694
Substrate
Meas. Tech.
ChEMBL_632470 (CHEMBL1108334)
Ki
0.07±n/a nM
Citation
 Mésangeau, CPérès, BDescamps-François, CChavatte, PAudinot, VCoumailleau, SBoutin, JADelagrange, PBennejean, CRenard, PCaignard, DHBerthelot, PYous, S Design, synthesis and pharmacological evaluation of novel naphthalenic derivatives as selective MT(1) melatoninergic ligands. Bioorg Med Chem 18:3426-36 (2010)  
Target
Name:
Melatonin receptor type 1A
Synonyms:
MTNR1A MTR1A_HUMAN Mel1a melatonin receptor Melatonin receptor Melatonin receptor type 1 (MT1) | Melatonin receptor type 1A
Type:
Enzyme
Mol. Mass.:
39392.94
Organism:
Homo sapiens (Human)
Description:
P48039
Residue:
350
  
Inhibitor
Name:
BDBM50316694
Synonyms:
CHEMBL1095196 | N-[2-(7-{4-[8-(Methoxycarbonylmethyl)naphthalen-2-yloxy]butoxy}naphthalen-1-yl)ethyl]acetamide
Type:
Small organic molecule
Emp. Form.:
C31H33NO5
Mol. Mass.:
499.5974
SMILES:
COC(=O)Cc1cccc2ccc(OCCCCOc3ccc4cccc(CCNC(C)=O)c4c3)cc12
: