Target
Nuclear factor NF-kappa-B p105 subunit
Ligand
BDBM50196926
Substrate
Meas. Tech.
ChEMBL_629937 (CHEMBL1109181)
IC50
75±n/a nM
Citation
 Ren, YKardono, LBRiswan, SChai, HFarnsworth, NRSoejarto, DDCarcache de Blanco, EJKinghorn, AD Cytotoxic and NF-kappaB inhibitory constituents of Artocarpus rigida. J Nat Prod 73:949-55 (2010)  
Target
Name:
Nuclear factor NF-kappa-B p105 subunit
Synonyms:
NFKB1 Nuclear factor NF-kappa-B (NF-kB) Nuclear factor NF-kappa-B p105 subunit
Type:
Protein
Mol. Mass.:
105329.57
Organism:
Homo sapiens (Human)
Description:
P19838
Residue:
968
  
Inhibitor
Name:
BDBM50196926
Synonyms:
CHEMBL438139 US10085988, Compound (-) Roc-A
Type:
Small organic molecule
Emp. Form.:
C29H31NO7
Mol. Mass.:
505.5589
SMILES:
COc1ccc(cc1)[C@@]12Oc3cc(OC)cc(OC)c3[C@]1(O)[C@H](O)[C@@H]([C@H]2c1ccccc1)C(=O)N(C)C
: