Target
Adenosine receptor A1
Ligand
BDBM50318290
Substrate
Meas. Tech.
ChEMBL_629506 (CHEMBL1120795)
Ki
>10000±n/a nM
Citation
 Taliani, SLa Motta, CMugnaini, LSimorini, FSalerno, SMarini, AMDa Settimo, FCosconati, SCosimelli, BGreco, GLimongelli, VMarinelli, LNovellino, ECiampi, ODaniele, STrincavelli, MLMartini, C Novel N2-substituted pyrazolo[3,4-d]pyrimidine adenosine A3 receptor antagonists: inhibition of A3-mediated human glioblastoma cell proliferation. J Med Chem 53:3954-63 (2010)  
Target
Name:
Adenosine receptor A1
Synonyms:
A1 adenosine receptor (hA1) AA1R_HUMAN ADORA1 Adenosine A1-receptor Adenosine receptor A1 (hA1) | Adenosine transporter (AdT)
Type:
G Protein-Coupled Receptor (GPCR)
Mol. Mass.:
36520.92
Organism:
Homo sapiens (Human)
Description:
P30542
Residue:
326
  
Inhibitor
Name:
BDBM50318290
Synonyms:
CHEMBL1094442 | N-(2-benzyl-2H-pyrazolo[3,4-d]pyrimidin-4-yl)benzamide
Type:
Small organic molecule
Emp. Form.:
C19H15N5O
Mol. Mass.:
329.3553
SMILES:
O=C(Nc1ncnc2nn(Cc3ccccc3)cc12)c1ccccc1
: