Target
Aurora kinase A
Ligand
BDBM50318575
Substrate
Meas. Tech.
ChEMBL_633156 (CHEMBL1119040)
IC50
3±n/a nM
Citation
 Bavetsias, VLarge, JMSun, CBouloc, NKosmopoulou, MMatteucci, MWilsher, NEMartins, VReynisson, JAtrash, BFaisal, AUrban, FValenti, Mde Haven Brandon, ABox, GRaynaud, FIWorkman, PEccles, SABayliss, RBlagg, JLinardopoulos, SMcDonald, E Imidazo[4,5-b]pyridine derivatives as inhibitors of Aurora kinases: lead optimization studies toward the identification of an orally bioavailable preclinical development candidate. J Med Chem 53:5213-28 (2010)  
Target
Name:
Aurora kinase A
Synonyms:
AIK ARK-1 AURA AURKA_HUMAN Aurora 2 Aurora kinase A (AURKA) Aurora kinase A (Aurora-2) Aurora/IPL1-related kinase 1 Breast tumor-amplified kinase IAK1 STK15 GN Serine/threonine kinase 15 Serine/threonine-protein kinase 6 Serine/threonine-protein kinase aurora-A aurora-2 | hARK1
Type:
Serine/threonine-protein kinase
Mol. Mass.:
45830.98
Organism:
Homo sapiens (Human)
Description:
O14965
Residue:
403
  
Inhibitor
Name:
BDBM50318575
Synonyms:
2-{4-[6-Chloro-2-(4-morpholin-4-ylmethylphenyl)-3H-imidazo[4,5-b]pyridin-7-yl]-piperazin-1-yl}-N-thiazol-2-yl-acetamide | CHEMBL1085848
Type:
Small organic molecule
Emp. Form.:
C26H29ClN8O2S
Mol. Mass.:
553.079
SMILES:
Clc1cnc2nc([nH]c2c1N1CCN(CC(=O)Nc2nccs2)CC1)-c1ccc(CN2CCOCC2)cc1
: