Target
Probable nicotinate-nucleotide adenylyltransferase
Ligand
BDBM50318662
Substrate
Meas. Tech.
ChEMBL_633236 (CHEMBL1119563)
IC50
>200000±n/a nM
Citation
 Huang, NKolhatkar, REyobo, YSorci, LRodionova, IOsterman, ALMackerell, ADZhang, H Complexes of bacterial nicotinate mononucleotide adenylyltransferase with inhibitors: implication for structure-based drug design and improvement. J Med Chem 53:5229-39 (2010)  
Target
Name:
Probable nicotinate-nucleotide adenylyltransferase
Synonyms:
BAMEG_4595 Deamido-NAD(+) pyrophosphorylase Nicotinate mononucleotide adenylyltransferase Nicotinate-nucleotide adenylyltransferase (NadD) nadD
Type:
Enzyme
Mol. Mass.:
21955.08
Organism:
Bacillus anthracis
Description:
C3L5T6
Residue:
189
  
Inhibitor
Name:
BDBM50318662
Synonyms:
CHEMBL1084868 {N-[3-(2-Chloro-phenylcarbamoyl)-propionyl]-N'-naphthalen-1-ylmethylene-hydrazino}-aceticAcid
Type:
Small organic molecule
Emp. Form.:
C23H20ClN3O4
Mol. Mass.:
437.876
SMILES:
OC(=O)CN(\N=C\c1cccc2ccccc12)C(=O)CCC(=O)Nc1ccccc1Cl
: