Target
Lysosomal acid lipase/cholesteryl ester hydrolase
Ligand
BDBM50318688
Substrate
Meas. Tech.
ChEMBL_633497 (CHEMBL1119694)
IC50
492±n/a nM
Citation
 Rosenbaum, AICosner, CCMariani, CJMaxfield, FRWiest, OHelquist, P Thiadiazole carbamates: potent inhibitors of lysosomal acid lipase and potential Niemann-Pick type C disease therapeutics. J Med Chem 53:5281-9 (2010)  
Target
Name:
Lysosomal acid lipase/cholesteryl ester hydrolase
Synonyms:
LICH_HUMAN | LIPA
Type:
PROTEIN
Mol. Mass.:
45422.01
Organism:
Homo sapiens (Human)
Description:
ChEMBL_633497
Residue:
399
  
Inhibitor
Name:
BDBM50318688
Synonyms:
3-N-Morpholinocarbamate-4-morpholino-1,2,5-thiadiazole cid_655946
Type:
Small organic molecule
Emp. Form.:
C11H16N4O4S
Mol. Mass.:
300.334
SMILES:
O=C(Oc1nsnc1N1CCOCC1)N1CCOCC1
: