Target
Neuraminidase
Ligand
BDBM50320771
Substrate
Meas. Tech.
ChEMBL_639158 (CHEMBL1167419)
IC50
7120±n/a nM
Citation
 Wen, WHWang, SYTsai, KCCheng, YSYang, ASFang, JMWong, CH Analogs of zanamivir with modified C4-substituents as the inhibitors against the group-1 neuraminidases of influenza viruses. Bioorg Med Chem 18:4074-84 (2010)  
Target
Name:
Neuraminidase
Synonyms:
NA | NRAM_I33A0
Type:
PROTEIN
Mol. Mass.:
49687.56
Organism:
Influenza A virus
Description:
ChEMBL_1347422
Residue:
453
  
Inhibitor
Name:
BDBM50320771
Synonyms:
5-Acetamido-2,6-anhydro-4-[N-(3-carboxypropyl)guanidino]-3,4,5-trideoxy-D-glycero-D-galacto-non-2-enonic acid | CHEMBL1164186
Type:
Small organic molecule
Emp. Form.:
C16H26N4O9
Mol. Mass.:
418.399
SMILES:
CC(=O)N[C@H]1[C@@H](OC(=C[C@@H]1N(CCCC(O)=O)C(N)=N)C(O)=O)[C@H](O)[C@H](O)CO
: