Target
Neuraminidase
Ligand
BDBM50320774
Substrate
Meas. Tech.
ChEMBL_639158 (CHEMBL1167419)
IC50
>200000±n/a nM
Citation
 Wen, WHWang, SYTsai, KCCheng, YSYang, ASFang, JMWong, CH Analogs of zanamivir with modified C4-substituents as the inhibitors against the group-1 neuraminidases of influenza viruses. Bioorg Med Chem 18:4074-84 (2010)  
Target
Name:
Neuraminidase
Synonyms:
NA | NRAM_I33A0
Type:
PROTEIN
Mol. Mass.:
49687.56
Organism:
Influenza A virus
Description:
ChEMBL_1347422
Residue:
453
  
Inhibitor
Name:
BDBM50320774
Synonyms:
5-Acetamido-2,6-anhydro-4-[N'-(4-aminobutyl)guanidino]-3,4,5-trideoxy-D-glycero-D-galacto-non-2-enonic acid | CHEMBL1163738
Type:
Small organic molecule
Emp. Form.:
C16H29N5O7
Mol. Mass.:
403.4308
SMILES:
CC(=O)N[C@@H]1[C@H](C=C(O[C@H]1[C@H](O)[C@H](O)CO)C(O)=O)N=C(N)NCCCCN
: