Target
Neuraminidase
Ligand
BDBM50320776
Substrate
Meas. Tech.
ChEMBL_639158 (CHEMBL1167419)
IC50
>200000±n/a nM
Citation
 Wen, WHWang, SYTsai, KCCheng, YSYang, ASFang, JMWong, CH Analogs of zanamivir with modified C4-substituents as the inhibitors against the group-1 neuraminidases of influenza viruses. Bioorg Med Chem 18:4074-84 (2010)  
Target
Name:
Neuraminidase
Synonyms:
NA | NRAM_I33A0
Type:
PROTEIN
Mol. Mass.:
49687.56
Organism:
Influenza A virus
Description:
ChEMBL_1347422
Residue:
453
  
Inhibitor
Name:
BDBM50320776
Synonyms:
5-Acetamido-2,6-anhydro-4-(4,5-dihydroimidazol-2-yl)amino-3,4,5-trideoxy-D-glycero-D-galacto-non-2-enonic acid | CHEMBL1164156
Type:
Small organic molecule
Emp. Form.:
C14H22N4O7
Mol. Mass.:
358.3471
SMILES:
[#6]-[#6](=O)-[#7]-[#6@H]-1-[#6@@H](-[#8]-[#6](=[#6]-[#6@@H]-1\[#7]=[#6]-1\[#7]-[#6]-[#6]-[#7]-1)-[#6](-[#8])=O)-[#6@H](-[#8])-[#6@H](-[#8])-[#6]-[#8]
: