Target
Progesterone receptor
Ligand
BDBM50321196
Substrate
Meas. Tech.
ChEMBL_637921 (CHEMBL1166107)
IC50
1555±n/a nM
Citation
 Du, YLi, QXiong, BHui, XWang, XFeng, YMeng, THu, DZhang, DWang, MShen, J Aromatic beta-amino-ketone derivatives as novel selective non-steroidal progesterone receptor antagonists. Bioorg Med Chem 18:4255-68 (2010)  
Target
Name:
Progesterone receptor
Synonyms:
NR3C3 PGR PRGR_HUMAN | progesterone
Type:
Protein
Mol. Mass.:
98979.52
Organism:
Homo sapiens (Human)
Description:
P06401
Residue:
933
  
Inhibitor
Name:
BDBM50321196
Synonyms:
CHEMBL1164752 | rac-3-(4-Nitrophenylamino)-1-(4-bromophenyl)-3-cyclohexylpropan-1-one
Type:
Small organic molecule
Emp. Form.:
C21H23BrN2O3
Mol. Mass.:
431.323
SMILES:
[O-][N+](=O)c1ccc(NC(CC(=O)c2ccc(Br)cc2)C2CCCCC2)cc1
: