Target
Histone deacetylase 8
Ligand
BDBM50321385
Substrate
Meas. Tech.
ChEMBL_640313 (CHEMBL1174638)
IC50
43160±n/a nM
Citation
 Chetan, BBunha, MJagrat, MSinha, BNSaiko, PGraser, GSzekeres, TRaman, GRajendran, PMoorthy, DBasu, AJayaprakash, V Design, synthesis and anticancer activity of piperazine hydroxamates and their histone deacetylase (HDAC) inhibitory activity. Bioorg Med Chem Lett 20:3906-10 (2010)  
Target
Name:
Histone deacetylase 8
Synonyms:
HD8 HDAC8_HUMAN Histone deacetylase 8 (HDAC-8) | Human HDAC8
Type:
Enzyme
Mol. Mass.:
41749.60
Organism:
Homo sapiens (Human)
Description:
Q9BY41
Residue:
377
  
Inhibitor
Name:
BDBM50321385
Synonyms:
4-(2-(4-chlorobenzylidene)hydrazinecarbonothioyl)-N-hydroxypiperazine-1-carboxamide | CHEMBL1171228
Type:
Small organic molecule
Emp. Form.:
C13H16ClN5O2S
Mol. Mass.:
341.816
SMILES:
ONC(=O)N1CCN(CC1)C(=S)NN=Cc1ccc(Cl)cc1
: