Target
Adenosine receptor A2a
Ligand
BDBM50321553
Substrate
Meas. Tech.
ChEMBL_639629 (CHEMBL1175307)
Ki
68±n/a nM
Citation
 Cheung, AWBrinkman, JFirooznia, FFlohr, AGrimsby, JGubler, MLGuertin, KHamid, RMarcopulos, NNorcross, RDQi, LRamsey, GTan, JWen, YSarabu, R 4-Substituted-7-N-alkyl-N-acetyl 2-aminobenzothiazole amides: drug-like and non-xanthine based A2B adenosine receptor antagonists. Bioorg Med Chem Lett 20:4140-6 (2010)  
Target
Name:
Adenosine receptor A2a
Synonyms:
A2A adenosine receptor (hA2A) ADENOSINE A2 ADORA2 Adenosine A2A receptor (A2AAR)
Type:
G Protein-Coupled Receptor (GPCR)
Mol. Mass.:
44716.46
Organism:
Homo sapiens (Human)
Description:
P29274
Residue:
412
  
Inhibitor
Name:
BDBM50321553
Synonyms:
CHEMBL1171200 | N-(7-(N-ethylacetamido)-4-methoxybenzo[d]thiazol-2-yl)-4-(pyrrolidine-1-carbonyl)benzamide
Type:
Small organic molecule
Emp. Form.:
C24H26N4O4S
Mol. Mass.:
466.553
SMILES:
CCN(C(C)=O)c1ccc(OC)c2nc(NC(=O)c3ccc(cc3)C(=O)N3CCCC3)sc12
: