Target
Adenosine receptor A2b
Ligand
BDBM50321521
Substrate
Meas. Tech.
ChEMBL_639630 (CHEMBL1175308)
Ki
19±n/a nM
Citation
 Cheung, AWBrinkman, JFirooznia, FFlohr, AGrimsby, JGubler, MLGuertin, KHamid, RMarcopulos, NNorcross, RDQi, LRamsey, GTan, JWen, YSarabu, R 4-Substituted-7-N-alkyl-N-acetyl 2-aminobenzothiazole amides: drug-like and non-xanthine based A2B adenosine receptor antagonists. Bioorg Med Chem Lett 20:4140-6 (2010)  
Target
Name:
Adenosine receptor A2b
Synonyms:
AA2BR_HUMAN ADORA2B Adenosine receptors A2b | Adenosine receptors; A2a & A2b
Type:
G Protein-Coupled Receptor (GPCR)
Mol. Mass.:
36341.22
Organism:
Homo sapiens (Human)
Description:
Residue:
332
  
Inhibitor
Name:
BDBM50321521
Synonyms:
CHEMBL1171163 | N-(7-(N-ethylacetamido)-4-methoxybenzo[d]thiazol-2-yl)-1-methyl-1H-pyrazole-4-carboxamide
Type:
Small organic molecule
Emp. Form.:
C17H19N5O3S
Mol. Mass.:
373.429
SMILES:
CCN(C(C)=O)c1ccc(OC)c2nc(NC(=O)c3cnn(C)c3)sc12
: