Target
Cyclin-dependent kinase 2
Ligand
BDBM50321581
Substrate
Meas. Tech.
ChEMBL_639725 (CHEMBL1175614)
IC50
319±n/a nM
Citation
 Angiolini, MBanfi, PCasale, ECasuscelli, FFiorelli, CSaccardo, MBSilvagni, MZuccotto, F Structure-based optimization of potent PDK1 inhibitors. Bioorg Med Chem Lett 20:4095-9 (2010)  
Target
Name:
Cyclin-dependent kinase 2
Synonyms:
CDK2 CDK2_HUMAN Cell division protein kinase 2 Protein cereblon/Cyclin-dependent kinase 2 | p33 protein kinase
Type:
Enzyme Subunit
Mol. Mass.:
33938.17
Organism:
Homo sapiens (Human)
Description:
P24941
Residue:
298
  
Inhibitor
Name:
BDBM50321581
Synonyms:
1-METHYL-8-{[4-(4-METHYLPIPERAZIN-1-YL)PHENYL]AMINO}-N-[(2-METHYLPYRIDIN-4-YL)METHYL]-4,5-DIHYDRO-1H-PYRAZOLO[4,3-H]QUINAZOLINE-3-CARBOXAMIDE CHEMBL1169805
Type:
Small organic molecule
Emp. Form.:
C29H33N9O
Mol. Mass.:
523.632
SMILES:
CN1CCN(CC1)c1ccc(Nc2ncc3CCc4c(nn(C)c4-c3n2)C(=O)NCc2ccnc(C)c2)cc1
: