Target
C-C chemokine receptor type 5
Ligand
BDBM50321707
Substrate
Meas. Tech.
ChEMBL_639942 (CHEMBL1174016)
IC50
3.6±n/a nM
Citation
 Ben, LJones, EDZhou, ELi, CBaylis, DCYu, SWang, MHe, XCoates, JARhodes, DIPei, GDeadman, JJXie, XMa, D Studies on the structure-activity relationship of 1,3,3,4-tetra-substituted pyrrolidine embodied CCR5 receptor antagonists. Part 1: Tuning the N-substituents. Bioorg Med Chem Lett 20:4012-4 (2010)  
Target
Name:
C-C chemokine receptor type 5
Synonyms:
C-C CKR-5 CC-CKR-5 CCR5 CCR5_HUMAN CHEMR13 HIV-1 fusion coreceptor
Type:
Enzyme
Mol. Mass.:
40540.21
Organism:
Homo sapiens (Human)
Description:
P51681
Residue:
352
  
Inhibitor
Name:
BDBM50321707
Synonyms:
CHEMBL1171030 | N-allyl-2-(4-chlorophenyl)-N-(1-(((3S,4R)-1-(cyclopentanecarbonyl)-4-hydroxy-4-phenylpyrrolidin-3-yl)methyl)piperidin-4-yl)acetamide
Type:
Small organic molecule
Emp. Form.:
C33H42ClN3O3
Mol. Mass.:
564.158
SMILES:
O[C@@]1(CN(C[C@@H]1CN1CCC(CC1)N(CC=C)C(=O)Cc1ccc(Cl)cc1)C(=O)C1CCCC1)c1ccccc1
: