Target
Sigma non-opioid intracellular receptor 1
Ligand
BDBM50322249
Substrate
Meas. Tech.
ChEMBL_642593 (CHEMBL1176482)
Ki
227±n/a nM
Citation
 Vangveravong, STaylor, MXu, JCui, JCalvin, WBabic, SLuedtke, RRMach, RH Synthesis and characterization of selective dopamine D2 receptor antagonists. 2. Azaindole, benzofuran, and benzothiophene analogs of L-741,626. Bioorg Med Chem 18:5291-300 (2010)  
Target
Name:
Sigma non-opioid intracellular receptor 1
Synonyms:
OPRS1 SIGMAR1 Sigma non-opioid intracellular receptor 1 Sigma1-receptor Sterol isomerase-like protein
Type:
Protein
Mol. Mass.:
25307.17
Organism:
Cavia porcellus (Guinea pig)
Description:
Q60492
Residue:
223
  
Inhibitor
Name:
BDBM50322249
Synonyms:
4-(4-Bromophenyl)-1-((5-(2-fluoroethoxy)-1H-indol-3-yl)-methyl)piperidin-4-ol oxalate | CHEMBL1173366
Type:
Small organic molecule
Emp. Form.:
C22H24BrFN2O2
Mol. Mass.:
447.341
SMILES:
OC1(CCN(Cc2c[nH]c3ccc(OCCF)cc23)CC1)c1ccc(Br)cc1
: