Target
C-C chemokine receptor type 5
Ligand
BDBM50322277
Substrate
Meas. Tech.
ChEMBL_642602 (CHEMBL1176491)
IC50
170±n/a nM
Citation
 Nishizawa, RNishiyama, THisaichi, KHirai, KHabashita, HTakaoka, YTada, HSagawa, KShibayama, SMaeda, KMitsuya, HNakai, HFukushima, DToda, M Discovery of orally available spirodiketopiperazine-based CCR5 antagonists. Bioorg Med Chem 18:5208-23 (2010)  
Target
Name:
C-C chemokine receptor type 5
Synonyms:
C-C CKR-5 CC-CKR-5 CCR5 CCR5_HUMAN CHEMR13 HIV-1 fusion coreceptor
Type:
Enzyme
Mol. Mass.:
40540.21
Organism:
Homo sapiens (Human)
Description:
P51681
Residue:
352
  
Inhibitor
Name:
BDBM50322277
Synonyms:
(3S)-1-Butyl-3-(cyclohexylmethyl)-9-[4-(phenylsulfanyl)benzyl]-1,4,9-triazaspiro[5.5]undecane-2,5-dione hydrochloride | CHEMBL1172871
Type:
Small organic molecule
Emp. Form.:
C32H43N3O2S
Mol. Mass.:
533.768
SMILES:
CCCCN1C(=O)[C@H](CC2CCCCC2)NC(=O)C11CCN(Cc2ccc(Sc3ccccc3)cc2)CC1
: