Target
Falcipain 2
Ligand
BDBM50322346
Substrate
Meas. Tech.
ChEMBL_642736 (CHEMBL1177216)
Ki
3480±n/a nM
Citation
 Bova, FEttari, RMicale, NCarnovale, CSchirmeister, TGelhaus, CLeippe, MGrasso, SZappalà, M Constrained peptidomimetics as antiplasmodial falcipain-2 inhibitors. Bioorg Med Chem 18:4928-38 (2010)  
Target
Name:
Falcipain 2
Synonyms:
Cysteine protease falcipain-2 Falcipain-2
Type:
Enzyme
Mol. Mass.:
55912.60
Organism:
Plasmodium falciparum
Description:
Recombinant falcipain-2.
Residue:
484
  
Inhibitor
Name:
BDBM50322346
Synonyms:
(R)-Methyl4-(2-(3-((naphthalen-1-ylcarbamoyloxy)methyl)-2-oxo-5-phenyl-2,3-dihydro-1H-benzo[e][1,4]diazepin-1-yl)acetamido)but-2-enoate | CHEMBL1171636
Type:
Small organic molecule
Emp. Form.:
C34H30N4O6
Mol. Mass.:
590.6252
SMILES:
COC(=O)\C=C\CNC(=O)CN1c2ccccc2C(=N[C@H](COC(=O)Nc2cccc3ccccc23)C1=O)c1ccccc1
: