Target
Cytochrome P450 3A4
Ligand
BDBM50322786
Substrate
Meas. Tech.
ChEMBL_642395 (CHEMBL1177588)
IC50
1770±n/a nM
Citation
 Hu, QYin, LJagusch, CHille, UEHartmann, RW Isopropylidene substitution increases activity and selectivity of biphenylmethylene 4-pyridine type CYP17 inhibitors. J Med Chem 53:5049-53 (2010)  
Target
Name:
Cytochrome P450 3A4
Synonyms:
Albendazole monooxygenase CP3A4_HUMAN CYP3A4 CYPIIIA4 Cytochrome P450 3A4 (CYP3A4) Nifedipine oxidase Taurochenodeoxycholate 6-alpha-hydroxylase
Type:
Enzyme
Mol. Mass.:
57349.57
Organism:
Homo sapiens (Human)
Description:
Residue:
503
  
Inhibitor
Name:
BDBM50322786
Synonyms:
4'-(2-methyl-1-(pyridin-4-yl)prop-1-enyl)biphenyl-3,4-diamine | CHEMBL1171991
Type:
Small organic molecule
Emp. Form.:
C21H21N3
Mol. Mass.:
315.4115
SMILES:
[#6]\[#6](-[#6])=[#6](/c1ccncc1)-c1ccc(cc1)-c1ccc(-[#7])c(-[#7])c1
: