Target
Mineralocorticoid receptor
Ligand
BDBM50324182
Substrate
Meas. Tech.
ChEMBL_649964 (CHEMBL1219662)
IC50
>1000±n/a nM
Citation
 Meyers, MJArhancet, GBHockerman, SLChen, XLong, SAMahoney, MWRico, JRGarland, DJBlinn, JRCollins, JTYang, SHuang, HCMcGee, KFWendling, JMDietz, JDPayne, MAHomer, BLHeron, MIReitz, DBHu, X Discovery of (3S,3aR)-2-(3-chloro-4-cyanophenyl)-3-cyclopentyl-3,3a,4,5-tetrahydro-2H-benzo[g]indazole-7-carboxylic acid (PF-3882845), an orally efficacious mineralocorticoid receptor (MR) antagonist for hypertension and nephropathy. J Med Chem 53:5979-6002 (2010)  
Target
Name:
Mineralocorticoid receptor
Synonyms:
MCR MLR NR3C2 | Nuclear receptor subfamily 3 group C member 2
Type:
Enzyme
Mol. Mass.:
107076.42
Organism:
Homo sapiens (Human)
Description:
P08235
Residue:
984
  
Inhibitor
Name:
BDBM50324182
Synonyms:
(+/-)-4-[1-(3,4-Dicyanophenyl)-5-(4-fluorophenyl)-4,5-dihydro-1H-pyrazol-3-yl]benzoic Acid | CHEMBL1214904
Type:
Small organic molecule
Emp. Form.:
C24H15FN4O2
Mol. Mass.:
410.3999
SMILES:
OC(=O)c1ccc(cc1)C1=NN(C(C1)c1ccc(F)cc1)c1ccc(C#N)c(c1)C#N
: